[Serdev] error compiling avpops module for ser downloaded from CVS

Deepak dlalmtl at gmail.com
Fri Oct 10 20:44:12 CEST 2008


Hi,
I am getting an error compiling avpops:

make[1]: Entering directory `/opt/NEWSER/sip_router/modules/avpops'
gcc -fPIC -DPIC -g -O9 -funroll-loops -Wcast-align -minline-all-stringops
-falign-loops -ftree-vectorize -mtune=athlon64 -Wall   -DNAME='"ser"'
-DVERSION='"2.1.0-dev23-make"' -DARCH='"i386"' -DOS='linux_'
-DOS_QUOTED='"linux"' -DCOMPILER='"gcc 4.1.2"' -D__CPU_i386 -D__OS_linux
-DSER_VER=2001000 -DCFG_DIR='"/usr/local/etc/ser/"'
-DMODS_DIR='"/usr/local/lib/ser/modules/"' -DPKG_MALLOC -DSHM_MEM -DSHM_MMAP
-DDNS_IP_HACK -DUSE_IPV6 -DUSE_MCAST -DUSE_TCP -DDISABLE_NAGLE
-DHAVE_RESOLV_RES -DUSE_DNS_CACHE -DUSE_DNS_FAILOVER -DUSE_DST_BLACKLIST
-DUSE_NAPTR -DDBG_QM_MALLOC -DUSE_TLS -DTLS_HOOKS -DFAST_LOCK
-DADAPTIVE_WAIT -DADAPTIVE_WAIT_LOOPS=1024 -DCC_GCC_LIKE_ASM
-DHAVE_GETHOSTBYNAME2 -DHAVE_UNION_SEMUN -DHAVE_SCHED_YIELD
-DHAVE_MSG_NOSIGNAL -DHAVE_MSGHDR_MSG_CONTROL -DHAVE_ALLOCA_H -DHAVE_TIMEGM
-DHAVE_SCHED_SETSCHEDULER -DHAVE_EPOLL -DHAVE_SIGIO_RT
-DSIGINFO64_WORKARROUND -DUSE_FUTEX -DHAVE_SELECT   -c avpops.c -o avpops.o
In file included from avpops_impl.h:41,
                 from avpops_parse.h:38,
                 from avpops.c:50:
avpops_db.h:66: error: expected â)â before â*â token
make[1]: *** [avpops.o] Error 1
make[1]: Leaving directory `/opt/NEWSER/sip_router/modules/avpops'
make: *** [modules] Error 1

Any suggestions?
Thanks
-------------- next part --------------
An HTML attachment was scrubbed...
URL: http://lists.iptel.org/pipermail/serdev/attachments/20081010/024af3d4/attachment.htm 


More information about the Serdev mailing list